Target
Gamma-aminobutyric acid receptor subunit alpha-1
Ligand
BDBM84740
Substrate
Ki
0.9±n/a nM
Comments
PDSP_969
Citation
 Giusti, PDucić, IPuia, GArban, RWalser, AGuidotti, ACosta, E Imidazenil: a new partial positive allosteric modulator of gamma-aminobutyric acid (GABA) action at GABAA receptors. J Pharmacol Exp Ther 266:1018-28 (1993) Target
Name:
Gamma-aminobutyric acid receptor subunit alpha-1
Synonyms:
Benzodiazepine central GABA A Benzodiazepine GABA A Benzodiazepine Type II GABA A Benzodiazepine Type IIM GABA A Benzodiazepine omega2 GABA A alpha1 GABA receptor alpha-1 subunit GABA-PICROTOXIN Gabra-1 TBPS
Type:
Enzyme
Mol. Mass.:
51770.21
Organism:
Rattus norvegicus (Rat)
Description:
P62813
Residue:
455
  
Inhibitor
Name:
BDBM84740
Synonyms:
CAS_119194 NSC_119194
Type:
Small organic molecule
Emp. Form.:
C18H12BrFN4O
Mol. Mass.:
399.216
SMILES:
NC(=O)c1ncn-2c1CN=C(c1ccccc1Br)c1cc(F)ccc-21
: