Target
5-hydroxytryptamine receptor 6
Ligand
BDBM50024206
Substrate
Ki
100±n/a nM
Comments
PDSP_437
Citation
 Plassat, JLAmlaiky, NHen, R Molecular cloning of a mammalian serotonin receptor that activates adenylate cyclase. Mol Pharmacol 44:229-36 (1993) Target
Name:
5-hydroxytryptamine receptor 6
Synonyms:
5-HT6 5HT6R_MOUSE | Htr6
Type:
Enzyme Catalytic Domain
Mol. Mass.:
47012.98
Organism:
MOUSE
Description:
5-HT6 HTR6 MOUSE::Q9R1C8
Residue:
440
  
Inhibitor
Name:
BDBM50024206
Synonyms:
3-[2-(dimethylamino)ethyl]-1H-indol-5-ol 3-[2-(dimethylamino)ethyl]indol-5-ol 5-hydroxy-N,N-dimethyltryptamine Bufotenine DM5-HT N,N-dimethylserotonin
Type:
Small organic molecule
Emp. Form.:
C12H16N2O
Mol. Mass.:
204.2682
SMILES:
CN(C)CCc1c[nH]c2ccc(O)cc12
: