Target
5-hydroxytryptamine receptor 6
Ligand
BDBM35234
Substrate
Ki
>10000±n/a nM
Comments
PDSP_1348
Citation
 Plassat, JLAmlaiky, NHen, R Molecular cloning of a mammalian serotonin receptor that activates adenylate cyclase. Mol Pharmacol 44:229-36 (1993) Target
Name:
5-hydroxytryptamine receptor 6
Synonyms:
5-HT6 5HT6R_MOUSE | Htr6
Type:
Enzyme Catalytic Domain
Mol. Mass.:
47012.98
Organism:
MOUSE
Description:
5-HT6 HTR6 MOUSE::Q9R1C8
Residue:
440
  
Inhibitor
Name:
BDBM35234
Synonyms:
DL-[7-3H]norepinephrine Noradrenaline,(+) | [3H]NE
Type:
radiolabeled ligand
Emp. Form.:
C8H11NO3
Mol. Mass.:
169.1778
SMILES:
NCC(O)c1ccc(O)c(O)c1
: