Target
Ribonucleoside-diphosphate reductase large subunit
Ligand
BDBM50000140
Substrate
Meas. Tech.
ChEMBL_195385 (CHEMBL806874)
IC50
60000±n/a nM
Citation
 Gaudreau, PBrazeau, PRicher, MCormier, JLanglois, DLangelier, Y Structure-function studies of peptides inhibiting the ribonucleotide reductase activity of herpes simplex virus type I. J Med Chem 35:346-50 (1992)  
Target
Name:
Ribonucleoside-diphosphate reductase large subunit
Synonyms:
RIR1_HUMAN RRM1 Ribonucleoside-diphosphate reductase subunit M1 | Ribonucleotide reductase large subunit
Type:
PROTEIN
Mol. Mass.:
90074.67
Organism:
Homo sapiens (Human)
Description:
ChEMBL_90946
Residue:
792
  
Inhibitor
Name:
BDBM50000140
Synonyms:
2-{2-[2-(2-{2-[2-(2-{2-[2-Amino-3-(4-hydroxy-phenyl)-propionylamino]-propionylamino}-acetylamino)-propionylamino]-3-methyl-butyrylamino}-3-methyl-butyrylamino)-3-carbamoyl-propionylamino]-3-carboxy-propionylamino}-4-methyl-pentanoic acid H-Tyr-Ala-Gly-Ala-Val-Val-Asn-Asp-Leu-OH Tyr-Ala-Gly-Ala-Val-Val-Asn-Asp-Leu YAGA-VVNDL
Type:
Small organic molecule
Emp. Form.:
C41H64N10O14
Mol. Mass.:
921.0055
SMILES:
CC(C)C[C@H](NC(=O)[C@H](CC(O)=O)NC(=O)[C@H](CC(N)=O)NC(=O)[C@@H](NC(=O)[C@@H](NC(=O)[C@H](C)NC(=O)CNC(=O)[C@H](C)NC(=O)[C@@H](N)Cc1ccc(O)cc1)C(C)C)C(C)C)C(O)=O
: