Target
Potassium-transporting ATPase alpha chain 1
Ligand
BDBM50230314
Substrate
Meas. Tech.
ChEMBL_76079 (CHEMBL686814)
IC50
500±n/a nM
Comments
Zero 12/22/2021
Citation
 Weidmann, KHerling, AWLang, HJScheunemann, KHRippel, RNimmesgern, HScholl, TBickel, MMetzger, H 2-[(2-pyridylmethyl)sulfinyl]-1H-thieno[3,4-d]imidazoles. A novel class of gastric H+/K(+)-ATPase inhibitors. J Med Chem 35:438-50 (1992)  
Target
Name:
Potassium-transporting ATPase alpha chain 1
Synonyms:
ATP4A Gastric H(+)/K(+) ATPase subunit alpha Na/K-ATPase Potassium-transporting ATPase alpha chain 1 | Proton pump
Type:
Enzyme
Mol. Mass.:
114279.23
Organism:
Sus scrofa (Pig)
Description:
P19156
Residue:
1034
  
Inhibitor
Name:
BDBM50230314
Synonyms:
CHEMBL342046
Type:
Small organic molecule
Emp. Form.:
C12H9F2N3O2S2
Mol. Mass.:
329.346
SMILES:
[O-][S+](Cc1ncccc1OC(F)F)c1nc2cscc2[nH]1
: