Target
Carbonic anhydrase 7
Ligand
BDBM50239272
Substrate
Meas. Tech.
ChEMBL_1665869 (CHEMBL4015665)
Ki
0.770000±n/a nM
Citation
 Bruno, EBuemi, MRDi Fiore, ADe Luca, LFerro, SAngeli, ACirilli, RSadutto, DAlterio, VMonti, SMSupuran, CTDe Simone, GGitto, R Probing Molecular Interactions between Human Carbonic Anhydrases (hCAs) and a Novel Class of Benzenesulfonamides. J Med Chem 60:4316-4326 (2017)  
Target
Name:
Carbonic anhydrase 7
Synonyms:
CA-VII CAH7_HUMAN Carbonic anhydrase Carbonic anhydrase VII (CA VII)
Type:
Enzyme
Mol. Mass.:
29664.11
Organism:
Homo sapiens (Human)
Description:
Human cloned isozyme.
Residue:
264
  
Inhibitor
Name:
BDBM50239272
Synonyms:
CHEMBL4098299
Type:
Small organic molecule
Emp. Form.:
C24H23ClN2O5S
Mol. Mass.:
486.968
SMILES:
COc1cc2CCN(C(c3ccc(Cl)cc3)c2cc1OC)C(=O)c1ccc(cc1)S(N)(=O)=O
: