Target
Polyunsaturated fatty acid 5-lipoxygenase
Ligand
BDBM50000544
Substrate
Meas. Tech.
ChEMBL_4196 (CHEMBL619998)
IC50
92±n/a nM
Citation
 Lau, CKBélanger, PCDufresne, CScheigetz, JTherien, MFitzsimmons, BYoung, RNFord-Hutchinson, AWRiendeau, DDenis, D Development of 2,3-dihydro-6-(3-phenoxypropyl)-2-(2-phenylethyl)-5-benzofuranol (L-670,630) as a potent and orally active inhibitor of 5-lipoxygenase. J Med Chem 35:1299-318 (1992)  
Target
Name:
Polyunsaturated fatty acid 5-lipoxygenase
Synonyms:
Alox5 LOX5_RAT
Type:
PROTEIN
Mol. Mass.:
78082.31
Organism:
Rattus norvegicus
Description:
ChEMBL_1432947
Residue:
673
  
Inhibitor
Name:
BDBM50000544
Synonyms:
3,3-Dimethyl-2-[2-(4-methylsulfanyl-phenyl)-ethyl]-6-propyl-2,3-dihydro-benzofuran-5-ol | CHEMBL24632
Type:
Small organic molecule
Emp. Form.:
C22H28O2S
Mol. Mass.:
356.522
SMILES:
CCCc1cc2OC(CCc3ccc(SC)cc3)C(C)(C)c2cc1O
: