Target
D(2) dopamine receptor
Ligand
BDBM50000597
Substrate
Meas. Tech.
ChEBML_62093
Ki
2800±n/a nM
Citation
 Erickson, RHNatalie, KJBock, WLu, ZFarzin, FSherrill, RGMeloni, DJPatch, RJRzesotarski, WJClifton, J (Aminoalkoxy)chromones. Selective sigma receptor ligands. J Med Chem 35:1526-35 (1992)  
Target
Name:
D(2) dopamine receptor
Synonyms:
DOPAMINE D2 DOPAMINE D2 Short Dopamine D2 receptor Drd2
Type:
G Protein-Coupled Receptor (GPCR)
Mol. Mass.:
50931.60
Organism:
Rattus norvegicus (rat)
Description:
P61169
Residue:
444
  
Inhibitor
Name:
BDBM50000597
Synonyms:
1-[6-(4-Oxo-2-phenyl-4H-chromen-6-yloxy)-hexyl]-piperidine-4-carboxylic acid ethyl ester | CHEMBL38708
Type:
Small organic molecule
Emp. Form.:
C29H35NO5
Mol. Mass.:
477.5919
SMILES:
CCOC(=O)C1CCN(CCCCCCOc2ccc3oc(cc(=O)c3c2)-c2ccccc2)CC1
: