Target
D(2) dopamine receptor
Ligand
BDBM50000578
Substrate
Meas. Tech.
ChEBML_62093
Ki
1800±n/a nM
Citation
 Erickson, RHNatalie, KJBock, WLu, ZFarzin, FSherrill, RGMeloni, DJPatch, RJRzesotarski, WJClifton, J (Aminoalkoxy)chromones. Selective sigma receptor ligands. J Med Chem 35:1526-35 (1992)  
Target
Name:
D(2) dopamine receptor
Synonyms:
DOPAMINE D2 DOPAMINE D2 Short Dopamine D2 receptor Drd2
Type:
G Protein-Coupled Receptor (GPCR)
Mol. Mass.:
50931.60
Organism:
Rattus norvegicus (rat)
Description:
P61169
Residue:
444
  
Inhibitor
Name:
BDBM50000578
Synonyms:
6-[6-(Benzyl-methyl-amino)-hexyloxy]-2-phenyl-chromen-4-one | CHEMBL38809
Type:
Small organic molecule
Emp. Form.:
C29H31NO3
Mol. Mass.:
441.5613
SMILES:
CN(CCCCCCOc1ccc2oc(cc(=O)c2c1)-c1ccccc1)Cc1ccccc1
: