Target
D(2) dopamine receptor
Ligand
BDBM50000638
Substrate
Meas. Tech.
ChEBML_62093
Ki
2700±n/a nM
Citation
 Erickson, RHNatalie, KJBock, WLu, ZFarzin, FSherrill, RGMeloni, DJPatch, RJRzesotarski, WJClifton, J (Aminoalkoxy)chromones. Selective sigma receptor ligands. J Med Chem 35:1526-35 (1992)  
Target
Name:
D(2) dopamine receptor
Synonyms:
DOPAMINE D2 DOPAMINE D2 Short Dopamine D2 receptor Drd2
Type:
G Protein-Coupled Receptor (GPCR)
Mol. Mass.:
50931.60
Organism:
Rattus norvegicus (rat)
Description:
P61169
Residue:
444
  
Inhibitor
Name:
BDBM50000638
Synonyms:
6-[6-(4-Hydroxy-piperidin-1-yl)-hexyloxy]-3-methyl-2-phenyl-chromen-4-one | CHEMBL38862
Type:
Small organic molecule
Emp. Form.:
C27H33NO4
Mol. Mass.:
435.5552
SMILES:
Cc1c(oc2ccc(OCCCCCCN3CCC(O)CC3)cc2c1=O)-c1ccccc1
: