Target
D(2) dopamine receptor
Ligand
BDBM50000622
Substrate
Meas. Tech.
ChEMBL_62093 (CHEMBL674973)
Ki
2200±n/a nM
Citation
 Erickson, RHNatalie, KJBock, WLu, ZFarzin, FSherrill, RGMeloni, DJPatch, RJRzesotarski, WJClifton, J (Aminoalkoxy)chromones. Selective sigma receptor ligands. J Med Chem 35:1526-35 (1992)  
Target
Name:
D(2) dopamine receptor
Synonyms:
DOPAMINE D2 DOPAMINE D2 Short Dopamine D2 receptor Drd2
Type:
G Protein-Coupled Receptor (GPCR)
Mol. Mass.:
50931.60
Organism:
Rattus norvegicus (rat)
Description:
P61169
Residue:
444
  
Inhibitor
Name:
BDBM50000622
Synonyms:
2-(2-Chloro-phenyl)-6-(6-piperidin-1-yl-hexyloxy)-chromen-4-one | CHEMBL37138
Type:
Small organic molecule
Emp. Form.:
C26H30ClNO3
Mol. Mass.:
439.974
SMILES:
Clc1ccccc1-c1cc(=O)c2cc(OCCCCCCN3CCCCC3)ccc2o1
: