Target
Platelet-activating factor receptor
Ligand
BDBM50000714
Substrate
Meas. Tech.
ChEBML_155155
Ki
98±n/a nM
Citation
 Guinn, DESummers, JBHeyman, HRConway, RGRhein, DAAlbert, DHMagoc, TCarter, GW Synthesis and structure-activity relationships of a series of novel benzopyran-containing platelet activating factor antagonists. J Med Chem 35:2055-61 (1992)  
Target
Name:
Platelet-activating factor receptor
Synonyms:
PAF-R PTAFR_CAVPO Platelet-activating factor receptor
Type:
Protein
Mol. Mass.:
39005.63
Organism:
Cavia porcellus
Description:
Residue:
342
  
Inhibitor
Name:
BDBM50000714
Synonyms:
3-[4-(2-Chloro-phenyl)-9-methyl-6H-1-thia-5,7,8,9a-tetraaza-cyclopenta[e]azulen-2-yl]-1-morpholin-4-yl-propan-1-one 3-[4-(2-Chloro-phenyl)-9-methyl-6H-1-thia-5,7,8,9a-tetraaza-cyclopenta[e]azulen-2-yl]-1-morpholin-4-yl-propan-1-one(WEB2086) CHEMBL280164 | WEB2086
Type:
Small organic molecule
Emp. Form.:
C22H22ClN5O2S
Mol. Mass.:
455.96
SMILES:
Cc1nnc2CN=C(c3cc(CCC(=O)N4CCOCC4)sc3-n12)c1ccccc1Cl
: