Target
Histone deacetylase 3/Nuclear receptor corepressor 2 (HDAC3/NCoR2)
Ligand
BDBM19149
Substrate
Meas. Tech.
ChEMBL_1667233 (CHEMBL4017029)
IC50
13±n/a nM
Citation
 Krieger, VHamacher, AGertzen, CGWSenger, JZwinderman, MRHMarek, MRomier, CDekker, FJKurz, TJung, MGohlke, HKassack, MUHansen, FK Design, Multicomponent Synthesis, and Anticancer Activity of a Focused Histone Deacetylase (HDAC) Inhibitor Library with Peptoid-Based Cap Groups. J Med Chem 60:5493-5506 (2017)  
Target
Name:
Histone deacetylase 3/Nuclear receptor corepressor 2 (HDAC3/NCoR2)
Synonyms:
HDAC3/NcoR2 Complex | Histone deacetylase 3/Nuclear receptor corepressor 2
Type:
Mol. Mass.:
Description:
ASSAY_ID of ChEMBL is 2146499
Components:
This complex has 2 components.
Component 1
Name:
Histone deacetylase 3
Synonyms:
HD3 HDAC3_HUMAN Human HDAC3 SMAP45
Type:
Enzyme
Mol. Mass.:
48829.55
Organism:
Homo sapiens (Human)
Description:
O15379
Residue:
428
  
Component 2
Name:
Nuclear receptor corepressor 2
Synonyms:
CTG repeat protein 26 Histone deacetylase 2/Nuclear receptor corepressor 2 NCOR2 Nuclear receptor corepressor 2 SMAP270 Silencing mediator of retinoic acid and thyroid hormone receptor TRAC | Thyroid-, retinoic-acid-receptor-associated corepressor
Type:
Enzyme
Mol. Mass.:
274839.59
Organism:
Homo sapiens (Human)
Description:
Q9Y618
Residue:
2514
  
Inhibitor
Name:
BDBM19149
Synonyms:
CHEMBL98 SAHA US10188756, Compound SAHA US11505523, Compound SAHA US9353061, SAHA US9695181, Vorinostat Zolinza suberoylanilide hydroxamic acid
Type:
Small organic molecule
Emp. Form.:
C14H20N2O3
Mol. Mass.:
264.3202
SMILES:
ONC(=O)CCCCCCC(=O)Nc1ccccc1
: