Target
Histone deacetylase 1
Ligand
BDBM50239856
Substrate
Meas. Tech.
ChEMBL_1667343 (CHEMBL4017139)
IC50
189±n/a nM
Citation
 Stenzel, KHamacher, AHansen, FKGertzen, CGWSenger, JMarquardt, VMarek, LMarek, MRomier, CRemke, MJung, MGohlke, HKassack, MUKurz, T Alkoxyurea-Based Histone Deacetylase Inhibitors Increase Cisplatin Potency in Chemoresistant Cancer Cell Lines. J Med Chem 60:5334-5348 (2017)  
Target
Name:
Histone deacetylase 1
Synonyms:
Cereblon/Histone deacetylase 1 HDAC1 Histone deacetylase 1 (HDAC1) RPD3L1
Type:
Enzyme
Mol. Mass.:
55090.27
Organism:
Homo sapiens (Human)
Description:
Q13547
Residue:
482
  
Inhibitor
Name:
BDBM50239856
Synonyms:
CHEMBL2311793
Type:
Small organic molecule
Emp. Form.:
C16H20N4O4
Mol. Mass.:
332.3544
SMILES:
ONC(=O)CCCCCONC(=O)Nc1cnc2ccccc2c1
: