Target
Bile salt export pump
Ligand
BDBM50238680
Substrate
Meas. Tech.
ChEMBL_1667662 (CHEMBL4017550)
IC50
<10000±n/a nM
Citation
 Warner, DJChen, HCantin, LDKenna, JGStahl, SWalker, CLNoeske, T Mitigating the inhibition of human bile salt export pump by drugs: opportunities provided by physicochemical property modulation, in silico modeling, and structural modification. Drug Metab Dispos 40:2332-41 (2012)  
Target
Name:
Bile salt export pump
Synonyms:
ABCB11 ATP-binding cassette sub-family B member 11 Bile Salt Export Pump, BSEP Bile salt export pump (BSEP)
Type:
Protein
Mol. Mass.:
146405.49
Organism:
Homo sapiens (Human)
Description:
O95342
Residue:
1321
  
Inhibitor
Name:
BDBM50238680
Synonyms:
CHEMBL4102921
Type:
Small organic molecule
Emp. Form.:
C18H18N2O2
Mol. Mass.:
294.3477
SMILES:
Cc1nc2c3OC(CCc3ccn2c1CO)c1ccccc1
: