Target
Bile salt export pump
Ligand
BDBM50239989
Substrate
Meas. Tech.
ChEMBL_1667662 (CHEMBL4017550)
IC50
<10000±n/a nM
Citation
 Warner, DJChen, HCantin, LDKenna, JGStahl, SWalker, CLNoeske, T Mitigating the inhibition of human bile salt export pump by drugs: opportunities provided by physicochemical property modulation, in silico modeling, and structural modification. Drug Metab Dispos 40:2332-41 (2012)  
Target
Name:
Bile salt export pump
Synonyms:
ABCB11 ATP-binding cassette sub-family B member 11 Bile Salt Export Pump, BSEP Bile salt export pump (BSEP)
Type:
Protein
Mol. Mass.:
146405.49
Organism:
Homo sapiens (Human)
Description:
O95342
Residue:
1321
  
Inhibitor
Name:
BDBM50239989
Synonyms:
CHEMBL4086948
Type:
Small organic molecule
Emp. Form.:
C31H29N5O3
Mol. Mass.:
519.5937
SMILES:
CN1CCN(CC1)c1ccc2ncn(-c3cc(NC(=O)c4cccc(c4)-c4ccco4)ccc3C)c(=O)c2c1
: