Target
cGMP-dependent 3',5'-cyclic phosphodiesterase
Ligand
BDBM50000937
Substrate
Meas. Tech.
ChEBML_155835
IC50
50000±n/a nM
Citation
 Meanwell, NAPearce, BCRoth, HRSmith, ECWedding, DLWright, JJBuchanan, JOBaryla, UMGamberdella, MGillespie, E Inhibitors of blood platelet cAMP phosphodiesterase. 2. Structure-activity relationships associated with 1,3-dihydro-2H-imidazo[4,5-b]quinolin-2-ones substituted with functionalized side chains. J Med Chem 35:2672-87 (1992)  
Target
Name:
cGMP-dependent 3',5'-cyclic phosphodiesterase
Synonyms:
CGS-PDE Homo sapiens phosphodiesterase 2A (PDE2A) PDE2A cGSPDE
Type:
Enzyme Catalytic Domain
Mol. Mass.:
105691.58
Organism:
Homo sapiens (Human)
Description:
O00408
Residue:
941
  
Inhibitor
Name:
BDBM50000937
Synonyms:
(2-Oxo-2,3-dihydro-1H-imidazo[4,5-b]quinolin-7-yloxy)-acetic acid | CHEMBL88525
Type:
Small organic molecule
Emp. Form.:
C12H9N3O4
Mol. Mass.:
259.2176
SMILES:
OC(=O)COc1ccc2nc3[nH]c(=O)[nH]c3cc2c1
: