Target
P2Y purinoceptor 12
Ligand
BDBM50000334
Substrate
Meas. Tech.
ChEMBL_89718 (CHEMBL696421)
EC50
1050±n/a nM
Citation
 Meanwell, NAPearce, BCRoth, HRSmith, ECWedding, DLWright, JJBuchanan, JOBaryla, UMGamberdella, MGillespie, E Inhibitors of blood platelet cAMP phosphodiesterase. 2. Structure-activity relationships associated with 1,3-dihydro-2H-imidazo[4,5-b]quinolin-2-ones substituted with functionalized side chains. J Med Chem 35:2672-87 (1992)  
Target
Name:
P2Y purinoceptor 12
Synonyms:
ADP-glucose receptor HORK3 P2T(AC) P2Y(AC) P2Y(cyc) P2Y12 platelet ADP receptor Purinergic receptor P2Y12 | SP1999
Type:
Enzyme
Mol. Mass.:
39458.48
Organism:
Homo sapiens (Human)
Description:
Q9H244
Residue:
342
  
Inhibitor
Name:
BDBM50000334
Synonyms:
6,7-Dichloro-1,5-dihydro-imidazo[2,1-b]quinazolin-2-one 6,7-Dichloro-1,5-dihydro-imidazo[2,1-b]quinazolin-2-one(anagrelide) Agrylin | CHEMBL760
Type:
Small organic molecule
Emp. Form.:
C10H7Cl2N3O
Mol. Mass.:
256.088
SMILES:
Clc1ccc2N=C3NC(=O)CN3Cc2c1Cl
: