Target
Carbonic anhydrase 12
Ligand
BDBM50240189
Substrate
Meas. Tech.
ChEMBL_1667780 (CHEMBL4017668)
Ki
6.4±n/a nM
Citation
 Carta, FVullo, DOsman, SMAlOthman, ZSupuran, CT Synthesis and carbonic anhydrase inhibition of a series of SLC-0111 analogs. Bioorg Med Chem 25:2569-2576 (2017)  
Target
Name:
Carbonic anhydrase 12
Synonyms:
CA-XII CAH12_HUMAN Carbonic anhydrase Carbonic anhydrase XII Carbonic anhydrase XII (CAXII) | Tumor antigen HOM-RCC-3.1.3
Type:
Enzyme
Mol. Mass.:
39456.00
Organism:
Homo sapiens (Human)
Description:
Catalytic domain of human cloned isozyme was used in the assay
Residue:
354
  
Inhibitor
Name:
BDBM50240189
Synonyms:
CHEMBL4069119 | US9962398, Compound MST-140
Type:
Small organic molecule
Emp. Form.:
C13H10F3N3O3S
Mol. Mass.:
345.297
SMILES:
NS(=O)(=O)c1ccc(NC(=O)Nc2ccc(F)c(F)c2F)cc1
: