Target
D(2) dopamine receptor
Ligand
BDBM50001120
Substrate
Meas. Tech.
ChEBML_61130
Ki
>388±n/a nM
Citation
 Ennis, MDBaze, MESmith, MWLawson, CFMcCall, RBLahti, RAPiercey, MF Novel indolodioxanes with antihypertensive effects: potent ligands for the 5-HT1A receptor. J Med Chem 35:3058-66 (1992)  
Target
Name:
D(2) dopamine receptor
Synonyms:
D(2) dopamine receptor DOPAMINE D2 Long DRD2 Dopamine D2 receptor Dopamine D2 receptor (D2R) Dopamine2-like | d2
Type:
Cell-surface receptors
Mol. Mass.:
50647.10
Organism:
Homo sapiens (Human)
Description:
P14416
Residue:
443
  
Inhibitor
Name:
BDBM50001120
Synonyms:
8-(4-Carbamoyl-4-phenylamino-piperidin-1-ylmethyl)-7,8-dihydro-3H-6,9-dioxa-3-aza-cyclopenta[a]naphthalene-2-carboxylic acid methyl ester | CHEMBL101483
Type:
Small organic molecule
Emp. Form.:
C25H28N4O5
Mol. Mass.:
464.5136
SMILES:
COC(=O)c1cc2c3OC(CN4CCC(CC4)(Nc4ccccc4)C(N)=O)COc3ccc2[nH]1
: