Target
Cytochrome P450 1A2
Ligand
BDBM8961
Substrate
Meas. Tech.
ChEMBL_1668101 (CHEMBL4017989)
IC50
1500±n/a nM
Citation
 McEneny-King, AOsman, WEdginton, ANRao, PPN Cytochrome P450 binding studies of novel tacrine derivatives: Predicting the risk of hepatotoxicity. Bioorg Med Chem Lett 27:2443-2449 (2017)  
Target
Name:
Cytochrome P450 1A2
Synonyms:
CP1A2_HUMAN CYPIA2 Cytochrome P(3)450 Cytochrome P450 1A2 (CYP1A2) Cytochrome P450-P3
Type:
Enzyme
Mol. Mass.:
58423.38
Organism:
Homo sapiens (Human)
Description:
P05177
Residue:
516
  
Inhibitor
Name:
BDBM8961
Synonyms:
1,2,3,4-tetrahydro-9-acridinamine 9-THA CHEMBL1337960 Cognex Tracine cid_1935 | tacrine.HCl
Type:
Small organic molecule
Emp. Form.:
C13H14N2
Mol. Mass.:
198.2637
SMILES:
Nc1c2CCCCc2nc2ccccc12
: