Target
Delta-type opioid receptor
Ligand
BDBM50001469
Substrate
Meas. Tech.
ChEBML_146595
Ki
562.0±n/a nM
Citation
 Schiller, PWWeltrowska, GNguyen, TMWilkes, BCChung, NNLemieux, C Conformationally restricted deltorphin analogues. J Med Chem 35:3956-61 (1992)  
Target
Name:
Delta-type opioid receptor
Synonyms:
Cytochrome P450 3A4 Delta opioid receptor Delta-type opioid receptor (DOR) OPRD_RAT Opioid receptor Opioid receptors; mu & delta Ror-a | Voltage-gated potassium channel
Type:
G Protein-Coupled Receptor (GPCR)
Mol. Mass.:
40465.04
Organism:
Rattus norvegicus (rat)
Description:
Competition binding assays were using CHO-K1 cell membranes expressing the opioid receptor.
Residue:
372
  
Inhibitor
Name:
BDBM50001469
Synonyms:
15-(2-{2-[2-Amino-3-(4-hydroxy-phenyl)-propionylamino]-propionylamino}-3-phenyl-propionylamino)-2,5-diisopropyl-3,6,13,16-tetraoxo-1,4,7,12tetraaza-cyclohexadecane-8-carboxylic acid amide | CHEMBL129815
Type:
Small organic molecule
Emp. Form.:
C40H57N9O9
Mol. Mass.:
807.9355
SMILES:
CC(C)[C@H]1NC(=O)[C@@H](NC(=O)[C@H](CC(=O)NCCC[C@@H](NC1=O)C(N)=O)NC(=O)[C@H](Cc1ccccc1)NC(=O)[C@@H](C)NC(=O)[C@@H](N)Cc1ccc(O)cc1)C(C)C
: