Target
Mu-type opioid receptor
Ligand
BDBM50001460
Substrate
Meas. Tech.
ChEMBL_147170 (CHEMBL754469)
Ki
4960±n/a nM
Citation
 Schiller, PWWeltrowska, GNguyen, TMWilkes, BCChung, NNLemieux, C Conformationally restricted deltorphin analogues. J Med Chem 35:3956-61 (1992)  
Target
Name:
Mu-type opioid receptor
Synonyms:
MOR-1 Mu-type opioid receptor (MOR) OPRM_RAT Opioid receptor B Ror-b
Type:
G Protein-Coupled Receptor (GPCR)
Mol. Mass.:
44503.11
Organism:
Rattus norvegicus (rat)
Description:
Competition binding assays were carried out using membrane preparations from transfected HN9.10 cells that constitutively expressed the mu opioid receptor.
Residue:
398
  
Inhibitor
Name:
BDBM50001460
Synonyms:
3-[(2-{2-[2-Amino-3-(4-hydroxy-phenyl)-propionylamino]-propionyl}-1,2,3,4-tetrahydro-isoquinoline-3-carbonyl)-amino]-N-{1-[1-(carbamoylmethyl-carbamoyl)-2-methyl-propylcarbamoyl]-2-methyl-propyl}-succinamic acid H-Tyr-D-Ala-Tic-Asp-Val-Val-Gly-NH2
Type:
Small organic molecule
Emp. Form.:
C38H52N8O10
Mol. Mass.:
780.8671
SMILES:
CC(C)[C@H](NC(=O)[C@@H](NC(=O)[C@H](CC(O)=O)NC(=O)[C@@H]1Cc2ccccc2CN1C(=O)[C@@H](C)NC(=O)[C@@H](N)Cc1ccc(O)cc1)C(C)C)C(=O)NCC(N)=O
: