Target
Mu-type opioid receptor
Ligand
BDBM50001463
Substrate
Meas. Tech.
ChEBML_73269
IC50
102±n/a nM
Citation
 Schiller, PWWeltrowska, GNguyen, TMWilkes, BCChung, NNLemieux, C Conformationally restricted deltorphin analogues. J Med Chem 35:3956-61 (1992)  
Target
Name:
Mu-type opioid receptor
Synonyms:
M-OR-1 Mu opioid receptor OPIATE Mu OPRM_CAVPO
Type:
Enzyme Catalytic Domain
Mol. Mass.:
11165.58
Organism:
GUINEA PIG
Description:
P97266
Residue:
98
  
Inhibitor
Name:
BDBM50001463
Synonyms:
14-[2-Amino-3-(4-hydroxy-phenyl)-propionylamino]-2-benzyl-3,8,15-trioxo-1,4,9triaza-cyclopentadecane-5-carboxylic acid {1-[1-(carbamoylmethyl-carbamoyl)-2-methyl-propylcarbamoyl]-2-methyl-propyl}-amide | CHEMBL132164
Type:
Small organic molecule
Emp. Form.:
C41H59N9O9
Mol. Mass.:
821.9621
SMILES:
CC(C)[C@H](NC(=O)[C@@H](NC(=O)[C@@H]1CCC(=O)NCCCC[C@@H](NC(=O)[C@@H](N)Cc2ccc(O)cc2)C(=O)N[C@@H](Cc2ccccc2)C(=O)N1)C(C)C)C(=O)NCC(N)=O
: