Target
Adenosine receptor A2a/A2b
Ligand
BDBM50001515
Substrate
Meas. Tech.
ChEBML_29285
Ki
133000±n/a nM
Citation
 Sakai, RKonno, KYamamoto, YSanae, FTakagi, KHasegawa, TIwasaki, NKakiuchi, MKato, HMiyamoto, K Effects of alkyl substitutions of xanthine skeleton on bronchodilation. J Med Chem 35:4039-44 (1992)  
Target
Name:
Adenosine receptor A2a/A2b
Synonyms:
Adenosine A2 receptor
Type:
Mol. Mass.:
Description:
ASSAY_ID of ChEMBL is 329906
Components:
This complex has 2 components.
Component 1
Name:
Adenosine receptor A2b
Synonyms:
AA2BR_HUMAN ADORA2B Adenosine receptors A2b | Adenosine receptors; A2a & A2b
Type:
G Protein-Coupled Receptor (GPCR)
Mol. Mass.:
36341.22
Organism:
Homo sapiens (Human)
Description:
Residue:
332
  
Component 2
Name:
Adenosine receptor A2a
Synonyms:
A2A adenosine receptor (hA2A) ADENOSINE A2 ADORA2 Adenosine A2A receptor (A2AAR)
Type:
G Protein-Coupled Receptor (GPCR)
Mol. Mass.:
44716.46
Organism:
Homo sapiens (Human)
Description:
P29274
Residue:
412
  
Inhibitor
Name:
BDBM50001515
Synonyms:
1-Methylxanthine (1-Mx) 3-Methyl-3,9-dihydro-purine-2,6-dione(3-methyl xanthine) | CHEMBL619
Type:
Small organic molecule
Emp. Form.:
C6H6N4O2
Mol. Mass.:
166.1374
SMILES:
Cn1c2nc[nH]c2c(=O)[nH]c1=O
: