Target
Leukotriene B4 receptor 1
Ligand
BDBM50001617
Substrate
Meas. Tech.
ChEMBL_99669 (CHEMBL705077)
IC50
150±n/a nM
Citation
 Labaudinière, RHendel, WTerlain, BCavy, FMarquis, ODereu, N omega-[(4-Phenyl-2-quinolyl)oxy]alkanoic acid derivatives: a new family of potent LTB4 antagonists. J Med Chem 35:4306-14 (1992)  
Target
Name:
Leukotriene B4 receptor 1
Synonyms:
BLT BLTR Chemoattractant receptor-like 1 GPR16 LTB4-R 1 Leukotriene B4 R1 Leukotriene B4 receptor 1 P2Y purinoceptor 7 | P2Y7
Type:
Enzyme Catalytic Domain
Mol. Mass.:
37582.68
Organism:
Homo sapiens (Human)
Description:
Q15722
Residue:
352
  
Inhibitor
Name:
BDBM50001617
Synonyms:
6-[4-(4-Chloro-phenyl)-quinolin-2-yloxy]-hexanoic acid | CHEMBL137168
Type:
Small organic molecule
Emp. Form.:
C21H20ClNO3
Mol. Mass.:
369.841
SMILES:
OC(=O)CCCCCOc1cc(-c2ccc(Cl)cc2)c2ccccc2n1
: