Target
Leukotriene B4 receptor 1
Ligand
BDBM50001611
Substrate
Meas. Tech.
ChEMBL_99669 (CHEMBL705077)
IC50
3.5±n/a nM
Citation
 Labaudinière, RHendel, WTerlain, BCavy, FMarquis, ODereu, N omega-[(4-Phenyl-2-quinolyl)oxy]alkanoic acid derivatives: a new family of potent LTB4 antagonists. J Med Chem 35:4306-14 (1992)  
Target
Name:
Leukotriene B4 receptor 1
Synonyms:
BLT BLTR Chemoattractant receptor-like 1 GPR16 LTB4-R 1 Leukotriene B4 R1 Leukotriene B4 receptor 1 P2Y purinoceptor 7 | P2Y7
Type:
Enzyme Catalytic Domain
Mol. Mass.:
37582.68
Organism:
Homo sapiens (Human)
Description:
Q15722
Residue:
352
  
Inhibitor
Name:
BDBM50001611
Synonyms:
(E)-3-{3-(2-Carboxy-ethyl)-4-[6-(4-methoxy-phenyl)-hex-5-enyloxy]-benzoyl}-benzoic acid 3-{3-(2-Carboxy-ethyl)-4-[(E)-6-(4-methoxy-phenyl)-hex-5-enyloxy]-benzoyl}-benzoic acid 3-{3-(2-Carboxy-ethyl)-4-[6-(4-methoxy-phenyl)-hex-5-enyloxy]-benzoyl}-benzoic acid (BT223982) CHEMBL49302 | LY-223982
Type:
Small organic molecule
Emp. Form.:
C30H30O7
Mol. Mass.:
502.555
SMILES:
COc1ccc(\C=C\CCCCOc2ccc(cc2CCC(O)=O)C(=O)c2cccc(c2)C(O)=O)cc1
: