Target
Leukotriene B4 receptor 1
Ligand
BDBM50001671
Substrate
Meas. Tech.
ChEBML_99487
IC50
300±n/a nM
Citation
 Labaudinière, RDereu, NCavy, FGuillet, MCMarquis, OTerlain, B omega-[(4,6-Diphenyl-2-pyridyl)oxy]alkanoic acid derivatives: a new family of potent and orally active LTB4 antagonists. J Med Chem 35:4315-24 (1992)  
Target
Name:
Leukotriene B4 receptor 1
Synonyms:
BLT BLTR Chemoattractant receptor-like 1 GPR16 LTB4-R 1 Leukotriene B4 R1 Leukotriene B4 receptor 1 P2Y purinoceptor 7 | P2Y7
Type:
Enzyme Catalytic Domain
Mol. Mass.:
37582.68
Organism:
Homo sapiens (Human)
Description:
Q15722
Residue:
352
  
Inhibitor
Name:
BDBM50001671
Synonyms:
4-(4,6-Diphenyl-pyridin-2-yloxy)-butyric acid | CHEMBL137633
Type:
Small organic molecule
Emp. Form.:
C21H19NO3
Mol. Mass.:
333.3805
SMILES:
OC(=O)CCCOc1cc(cc(n1)-c1ccccc1)-c1ccccc1
: