Target
Leukocyte tyrosine kinase receptor
Ligand
BDBM50240779
Substrate
Meas. Tech.
ChEMBL_1668757 (CHEMBL4018645)
IC50
45±n/a nM
Citation
 Zhu, WChen, HWang, YWang, JPeng, XChen, XGao, YLi, CHe, YAi, JGeng, MZheng, MLiu, H Design, Synthesis, and Pharmacological Evaluation of Novel Multisubstituted Pyridin-3-amine Derivatives as Multitargeted Protein Kinase Inhibitors for the Treatment of Non-Small Cell Lung Cancer. J Med Chem 60:6018-6035 (2017)  
Target
Name:
Leukocyte tyrosine kinase receptor
Synonyms:
LTK TYK1
Type:
PROTEIN
Mol. Mass.:
91679.76
Organism:
Homo sapiens (Human)
Description:
ChEMBL_586334
Residue:
864
  
Inhibitor
Name:
BDBM50240779
Synonyms:
CHEMBL4067871
Type:
Small organic molecule
Emp. Form.:
C28H22ClN3O2
Mol. Mass.:
467.946
SMILES:
OC[C@H](Nc1cnc(-c2cc(Cl)ccc2O)c(c1)-c1ccc2cnccc2c1)c1ccccc1
: