Target
Mu-type opioid receptor
Ligand
BDBM50001717
Substrate
Meas. Tech.
ChEBML_146555
Ki
1413±n/a nM
Citation
 Salvadori, SBianchi, CLazarus, LHScaranari, VAttila, MTomatis, R Para-substituted Phe3 deltorphin analogues: enhanced selectivity of halogenated derivatives for delta opioid receptor sites. J Med Chem 35:4651-7 (1993)  
Target
Name:
Mu-type opioid receptor
Synonyms:
MOR-1 Mu-type opioid receptor (MOR) OPRM_RAT Opioid receptor B Ror-b
Type:
G Protein-Coupled Receptor (GPCR)
Mol. Mass.:
44503.11
Organism:
Rattus norvegicus (rat)
Description:
Competition binding assays were carried out using membrane preparations from transfected HN9.10 cells that constitutively expressed the mu opioid receptor.
Residue:
398
  
Inhibitor
Name:
BDBM50001717
Synonyms:
3-[2-{2-[2-Amino-3-(4-hydroxy-phenyl)-propionylamino]-propionylamino}-3-(4-iodo-phenyl)-propionylamino]-N-{1-[1-(carbamoylmethyl-carbamoyl)-2-methyl-propylcarbamoyl]-2-methyl-propyl}-succinamic acid | CHEMBL142547
Type:
Small organic molecule
Emp. Form.:
C37H51IN8O10
Mol. Mass.:
894.7529
SMILES:
CC(C)[C@H](NC(=O)[C@@H](NC(=O)[C@H](CC(O)=O)NC(=O)[C@H](Cc1ccc(I)cc1)NC(=O)[C@@H](C)NC(=O)[C@@H](N)Cc1ccc(O)cc1)C(C)C)C(=O)NCC(N)=O
: