Target
Carbonic anhydrase 2
Ligand
BDBM50227239
Substrate
Meas. Tech.
ChEMBL_1669310 (CHEMBL4019198)
Kd
>2000000±n/a nM
Citation
 Chrysanthopoulos, PKMujumdar, PWoods, LADolezal, ORen, BPeat, TSPoulsen, SA Identification of a New Zinc Binding Chemotype by Fragment Screening. J Med Chem 60:7333-7349 (2017)  
Target
Name:
Carbonic anhydrase 2
Synonyms:
CA-II CAC Carbonate dehydratase II Carbonic anhydrase 2 (CA-II) Carbonic anhydrase C Carbonic anhydrase II (CA-II) Carbonic anhydrase II (hCA II) | Carbonic anhydrase isoenzyme II (hCA II)
Type:
Enzyme
Mol. Mass.:
29250.71
Organism:
Homo sapiens (Human)
Description:
P00918
Residue:
260
  
Inhibitor
Name:
BDBM50227239
Synonyms:
Tridione Troxidone
Type:
Small organic molecule
Emp. Form.:
C6H9NO3
Mol. Mass.:
143.1406
SMILES:
CN1C(=O)OC(C)(C)C1=O
: