Target
D(2) dopamine receptor
Ligand
BDBM50001799
Substrate
Meas. Tech.
ChEBML_58717
IC50
280±n/a nM
Citation
 Perregaard, JAndersen, KHyttel, JSánchez, C Selective, centrally acting serotonin 5-HT2 antagonists. 1. 2- and 6-substituted 1-phenyl-3-(4-piperidinyl)-1H-indoles. J Med Chem 35:4813-22 (1993)  
Target
Name:
D(2) dopamine receptor
Synonyms:
DOPAMINE D2 DOPAMINE D2 Short Dopamine D2 receptor Drd2
Type:
G Protein-Coupled Receptor (GPCR)
Mol. Mass.:
50931.60
Organism:
Rattus norvegicus (rat)
Description:
P61169
Residue:
444
  
Inhibitor
Name:
BDBM50001799
Synonyms:
1-(2-{4-[1-(4-Fluoro-phenyl)-6-trifluoromethyl-1H-indol-3-yl]-piperidin-1-yl}-ethyl)-3-isopropyl-imidazolidin-2-one | CHEMBL144184
Type:
Small organic molecule
Emp. Form.:
C28H32F4N4O
Mol. Mass.:
516.5735
SMILES:
CC(C)N1CCN(CCN2CCC(CC2)c2cn(-c3ccc(F)cc3)c3cc(ccc23)C(F)(F)F)C1=O
: