Target
D(2) dopamine receptor
Ligand
BDBM50001805
Substrate
Meas. Tech.
ChEBML_61406
IC50
530±n/a nM
Citation
 Andersen, KPerregaard, JArnt, JNielsen, JBBegtrup, M Selective, centrally acting serotonin 5-HT2 antagonists. 2. Substituted 3-(4-fluorophenyl)-1H-indoles. J Med Chem 35:4823-31 (1993)  
Target
Name:
D(2) dopamine receptor
Synonyms:
DOPAMINE D2 DOPAMINE D2 Short Dopamine D2 receptor Drd2
Type:
G Protein-Coupled Receptor (GPCR)
Mol. Mass.:
50931.60
Organism:
Rattus norvegicus (rat)
Description:
P61169
Residue:
444
  
Inhibitor
Name:
BDBM50001805
Synonyms:
1-(2-{4-[3-(4-Fluoro-phenyl)-7-methyl-indol-1-yl]-3,6-dihydro-2H-pyridin-1-yl}-ethyl)-imidazolidin-2-one | CHEMBL141667
Type:
Small organic molecule
Emp. Form.:
C25H27FN4O
Mol. Mass.:
418.5065
SMILES:
Cc1cccc2c(cn(C3=CCN(CCN4CCNC4=O)CC3)c12)-c1ccc(F)cc1
: