Target
Alpha-1A adrenergic receptor
Ligand
BDBM50001811
Substrate
Meas. Tech.
ChEBML_33271
IC50
24±n/a nM
Citation
 Andersen, KPerregaard, JArnt, JNielsen, JBBegtrup, M Selective, centrally acting serotonin 5-HT2 antagonists. 2. Substituted 3-(4-fluorophenyl)-1H-indoles. J Med Chem 35:4823-31 (1993)  
Target
Name:
Alpha-1A adrenergic receptor
Synonyms:
ADA1A_RAT Adra1c Alpha-1A adrenoceptor Alpha-1C adrenergic receptor | adrenergic Alpha1A
Type:
Protein
Mol. Mass.:
51620.15
Organism:
Rattus norvegicus (Rat)
Description:
P43140
Residue:
466
  
Inhibitor
Name:
BDBM50001811
Synonyms:
1-(2-{4-[3-(4-Fluoro-phenyl)-5-methyl-indol-1-yl]-3,6-dihydro-2H-pyridin-1-yl}-ethyl)-imidazolidin-2-one | CHEMBL343034
Type:
Small organic molecule
Emp. Form.:
C25H27FN4O
Mol. Mass.:
418.5065
SMILES:
Cc1ccc2n(cc(-c3ccc(F)cc3)c2c1)C1=CCN(CCN2CCNC2=O)CC1
: