Target
Phosphatidylinositol 4-kinase beta
Ligand
BDBM50358204
Substrate
Meas. Tech.
ChEMBL_1669398 (CHEMBL4019286)
Kd
>30000±n/a nM
Citation
 Beaufils, FCmiljanovic, NCmiljanovic, VBohnacker, TMelone, AMarone, RJackson, EZhang, XSele, ABorsari, CMestan, JHebeisen, PHillmann, PGiese, BZvelebil, MFabbro, DWilliams, RLRageot, DWymann, MP 5-(4,6-Dimorpholino-1,3,5-triazin-2-yl)-4-(trifluoromethyl)pyridin-2-amine (PQR309), a Potent, Brain-Penetrant, Orally Bioavailable, Pan-Class I PI3K/mTOR Inhibitor as Clinical Candidate in Oncology. J Med Chem 60:7524-7538 (2017)  
Target
Name:
Phosphatidylinositol 4-kinase beta
Synonyms:
NPIK PI4K-beta PI4KB PI4Kbeta PIK4CB Phosphatidylinositol 4-kinase, PI4K | PtdIns 4-kinase beta
Type:
Protein
Mol. Mass.:
91373.30
Organism:
Homo sapiens (Human)
Description:
Residue:
816
  
Inhibitor
Name:
BDBM50358204
Synonyms:
CHEMBL1922094
Type:
Small organic molecule
Emp. Form.:
C23H30N8O3S
Mol. Mass.:
498.601
SMILES:
C[C@H](O)C(=O)N1CCN(Cc2sc3c(nc(nc3c2C)-c2cnc(N)nc2)N2CCOCC2)CC1
: