Target
Beta-2 adrenergic receptor
Ligand
BDBM50001916
Substrate
Meas. Tech.
ChEBML_37833
IC50
>100000±n/a nM
Citation
 Phillips, GBMorgan, TKLumma, WCGomez, RPLind, JMLis, RArgentieri, TSullivan, ME Synthesis, cardiac electrophysiology, and beta-blocking activity of novel arylpiperazines with potential as class II/III antiarrhythmic agents. J Med Chem 35:743-50 (1992)  
Target
Name:
Beta-2 adrenergic receptor
Synonyms:
ADRB2 | ADRB2_CANLF
Type:
PROTEIN
Mol. Mass.:
46593.67
Organism:
Canis familiaris
Description:
ChEMBL_56504
Residue:
415
  
Inhibitor
Name:
BDBM50001916
Synonyms:
4-Phenyl-piperazine-2-carboxylic acid (4-methanesulfonylamino-phenyl)-amide | CHEMBL163363
Type:
Small organic molecule
Emp. Form.:
C18H22N4O3S
Mol. Mass.:
374.457
SMILES:
CS(=O)(=O)Nc1ccc(NC(=O)C2CN(CCN2)c2ccccc2)cc1
: