Target
Beta-1 adrenergic receptor
Ligand
BDBM50001912
Substrate
Meas. Tech.
ChEBML_39159
IC50
160±n/a nM
Citation
 Phillips, GBMorgan, TKLumma, WCGomez, RPLind, JMLis, RArgentieri, TSullivan, ME Synthesis, cardiac electrophysiology, and beta-blocking activity of novel arylpiperazines with potential as class II/III antiarrhythmic agents. J Med Chem 35:743-50 (1992)  
Target
Name:
Beta-1 adrenergic receptor
Synonyms:
ADRB1 ADRB1_HUMAN Beta-1 adrenoceptor | adrenergic Beta1
Type:
G Protein-Coupled Receptor (GPCR)
Mol. Mass.:
51338.40
Organism:
Homo sapiens (Human)
Description:
P08588
Residue:
477
  
Inhibitor
Name:
BDBM50001912
Synonyms:
4-Methanesulfonylamino-N-(4-phenyl-piperazin-2-ylmethyl)-benzamide | CHEMBL162513
Type:
Small organic molecule
Emp. Form.:
C19H24N4O3S
Mol. Mass.:
388.484
SMILES:
CS(=O)(=O)Nc1ccc(cc1)C(=O)NCC1CN(CCN1)c1ccccc1
: