Target
D(2) dopamine receptor
Ligand
BDBM50019966
Substrate
Meas. Tech.
ChEBML_61411
IC50
10±n/a nM
Citation
 Perregaard, JArnt, JBøgesø, KPHyttel, JSánchez, C Noncataleptogenic, centrally acting dopamine D-2 and serotonin 5-HT2 antagonists within a series of 3-substituted 1-(4-fluorophenyl)-1H-indoles. J Med Chem 35:1092-101 (1992)  
Target
Name:
D(2) dopamine receptor
Synonyms:
DOPAMINE D2 DOPAMINE D2 Short Dopamine D2 receptor Drd2
Type:
G Protein-Coupled Receptor (GPCR)
Mol. Mass.:
50931.60
Organism:
Rattus norvegicus (rat)
Description:
P61169
Residue:
444
  
Inhibitor
Name:
BDBM50019966
Synonyms:
2-{4-[(1R,3S)-3-(4-Fluoro-phenyl)-6-trifluoromethyl-indan-1-yl]-piperazin-1-yl}-ethanol CHEMBL95636 | Tefludazine
Type:
Small organic molecule
Emp. Form.:
C22H24F4N2O
Mol. Mass.:
408.4324
SMILES:
OCCN1CCN(CC1)[C@@H]1C[C@H](c2ccc(cc12)C(F)(F)F)c1ccc(F)cc1
: