Target
Heat shock protein HSP 90-alpha
Ligand
BDBM50009702
Substrate
Meas. Tech.
ChEMBL_1670169 (CHEMBL4020057)
IC50
>1250000±n/a nM
Citation
 Goswami, MWilke, KECarlson, EE Rational Design of Selective Adenine-Based Scaffolds for Inactivation of Bacterial Histidine Kinases. J Med Chem 60:8170-8182 (2017)  
Target
Name:
Heat shock protein HSP 90-alpha
Synonyms:
HS90A_HUMAN HSP86 HSP90AA1 HSPCA Heat shock 86 kDa Heat shock protein HSP 90-alpha (HSP90) LAP-2 Lipopolysaccharide-associated protein 2 heat shock protein 90kDa alpha (cytosolic), class A member 1 isoform 2
Type:
Molecular Chaperone
Mol. Mass.:
84623.45
Organism:
Homo sapiens (Human)
Description:
P07900
Residue:
732
  
Inhibitor
Name:
BDBM50009702
Synonyms:
2-Chloro-9-methyl-9H-purin-6-ylamine | CHEMBL317398
Type:
Small organic molecule
Emp. Form.:
C6H6ClN5
Mol. Mass.:
183.598
SMILES:
Cn1cnc2c(N)nc(Cl)nc12
: