Target
Beta-1 adrenergic receptor
Ligand
BDBM50002132
Substrate
Meas. Tech.
ChEMBL_37533 (CHEMBL647376)
IC50
59±n/a nM
Citation
 Bloom, JDDutia, MDJohnson, BDWissner, ABurns, MGLargis, EEDolan, JAClaus, TH Disodium (R,R)-5-[2-[[2-(3-chlorophenyl)-2-hydroxyethyl]-amino] propyl]-1,3-benzodioxole-2,2-dicarboxylate (CL 316,243). A potent beta-adrenergic agonist virtually specific for beta 3 receptors. A promising antidiabetic and antiobesity agent. J Med Chem 35:3081-4 (1992)  
Target
Name:
Beta-1 adrenergic receptor
Synonyms:
ADRB1R, B1AR Adrb1 Adrenergic receptor beta Beta-1 adrenoreceptor adrenergic Beta1,2
Type:
Protein
Mol. Mass.:
50486.84
Organism:
Rattus norvegicus (Rat)
Description:
P18090
Residue:
466
  
Inhibitor
Name:
BDBM50002132
Synonyms:
(4-{(R)-2-[(R)-2-(3-Chloro-phenyl)-2-hydroxy-ethylamino]-propyl}-phenoxy)-acetic acid methyl ester CHEMBL38486
Type:
Small organic molecule
Emp. Form.:
C20H24ClNO4
Mol. Mass.:
377.862
SMILES:
COC(=O)COc1ccc(C[C@@H](C)NC[C@H](O)c2cccc(Cl)c2)cc1
: