Target
Prostacyclin receptor
Ligand
BDBM50002404
Substrate
Meas. Tech.
ChEBML_158010
IC50
160±n/a nM
Citation
 Meanwell, NARosenfeld, MJWright, JJBrassard, CLBuchanan, JOFederici, MEFleming, JSSeiler, SM Structure-activity relationships associated with 3,4,5-triphenyl-1H-pyrazole-1-nonanoic acid, a nonprostanoid prostacyclin mimetic. J Med Chem 35:389-97 (1992)  
Target
Name:
Prostacyclin receptor
Synonyms:
PGI receptor PRIPR Prostacyclin (IP) Receptor Prostaglandin I Prostaglandin I2 receptor | Prostanoid IP receptor
Type:
G Protein-Coupled Receptor (GPCR)
Mol. Mass.:
40968.22
Organism:
Homo sapiens (Human)
Description:
The membranes prepared from human platelet were used in binding assay.
Residue:
386
  
Inhibitor
Name:
BDBM50002404
Synonyms:
9-(3,4,5-Triphenyl-pyrazol-1-yl)-nonanoic acid | CHEMBL118567
Type:
Small organic molecule
Emp. Form.:
C30H32N2O2
Mol. Mass.:
452.5873
SMILES:
OC(=O)CCCCCCCCn1nc(c(c1-c1ccccc1)-c1ccccc1)-c1ccccc1
: