Target
Thromboxane A2 receptor
Ligand
BDBM50002820
Substrate
Meas. Tech.
ChEBML_209762
Ki
4±n/a nM
Citation
 Ohshima, ETakami, HSato, HMohri, SObase, HMiki, IIshii, AShirakura, SKarasawa, AKubo, K Non-prostanoid thromboxane A2 receptor antagonists with a dibenzoxepin ring system. 2. J Med Chem 35:3402-13 (1992)  
Target
Name:
Thromboxane A2 receptor
Synonyms:
Prostanoid TP receptor TBXA2R Thromboxane Thromboxane Beta
Type:
Enyzme
Mol. Mass.:
37445.28
Organism:
Homo sapiens (Human)
Description:
P21731
Residue:
343
  
Inhibitor
Name:
BDBM50002820
Synonyms:
11-[2-(2-Hydroxy-benzoimidazol-1-yl)-ethylidene]-6,11-dihydro-dibenzo[b,e]oxepine-2-carboxylic acid | CHEMBL114034
Type:
Small organic molecule
Emp. Form.:
C24H18N2O4
Mol. Mass.:
398.4107
SMILES:
OC(=O)c1ccc2OCc3ccccc3\C(=C/Cn3c4ccccc4[nH]c3=O)c2c1
: