Target
Sodium channel protein type 9 subunit alpha
Ligand
BDBM50242510
Substrate
Meas. Tech.
ChEMBL_1671680 (CHEMBL4021709)
IC50
39±n/a nM
Citation
 Pero, JERossi, MALehman, HDGFKelly, MJMulhearn, JJWolkenberg, SECato, MJClements, MKDaley, CJFilzen, TFinger, ENGregan, YHenze, DAJovanovska, AKlein, RKraus, RLLi, YLiang, AMajercak, JMPanigel, JUrban, MOWang, JWang, YHHoughton, AKLayton, ME Benzoxazolinone aryl sulfonamides as potent, selective Na Bioorg Med Chem Lett 27:2683-2688 (2017)  
Target
Name:
Sodium channel protein type 9 subunit alpha
Synonyms:
NENA Peripheral sodium channel 1 SCN9A_HUMAN Voltage-gated sodium channel subunit Nav1.7 hNE-Na
Type:
Protein
Mol. Mass.:
226375.97
Organism:
Homo sapiens (Human)
Description:
Q15858
Residue:
1988
  
Inhibitor
Name:
BDBM50242510
Synonyms:
CHEMBL4095146
Type:
Small organic molecule
Emp. Form.:
C21H18F2N4O4S
Mol. Mass.:
460.454
SMILES:
C[C@H](c1ccccc1CN)n1c2cc(F)c(cc2oc1=O)S(=O)(=O)Nc1cccc(F)n1
: