Target
5-hydroxytryptamine receptor 2C
Ligand
BDBM50003037
Substrate
Meas. Tech.
ChEMBL_1843 (CHEMBL616814)
IC50
100±n/a nM
Citation
 Macor, JEFox, CBJohnson, CKoe, BKLebel, LAZorn, SH 1-(2-Aminoethyl)-3-methyl-8,9-dihydropyrano[3,2-e]indole: a rotationally restricted phenolic analog of the neurotransmitter serotonin and agonist selective for serotonin (5-HT2-type) receptors. J Med Chem 35:3625-32 (1992)  
Target
Name:
5-hydroxytryptamine receptor 2C
Synonyms:
5-HT-2C 5-HT2C-INI 5-HTR2C 5-hydroxytryptamine receptor 2C (5-HT-2C) 5HT-1C HTR1C Serotonin (5-HT3) receptor Serotonin Receptor 2C
Type:
G Protein-Coupled Receptor (GPCR)
Mol. Mass.:
51836.79
Organism:
Homo sapiens (Human)
Description:
P28335
Residue:
458
  
Inhibitor
Name:
BDBM50003037
Synonyms:
2-(3-Methyl-3,7,8,9-tetrahydro-pyrano[3,2-e]indol-1-yl)-ethylamine | CHEMBL25800
Type:
Small organic molecule
Emp. Form.:
C14H18N2O
Mol. Mass.:
230.3055
SMILES:
Cn1cc(CCN)c2c3CCCOc3ccc12
: