Target
5-hydroxytryptamine receptor 1D
Ligand
BDBM50003036
Substrate
Meas. Tech.
ChEBML_1631
IC50
220±n/a nM
Citation
 Macor, JEFox, CBJohnson, CKoe, BKLebel, LAZorn, SH 1-(2-Aminoethyl)-3-methyl-8,9-dihydropyrano[3,2-e]indole: a rotationally restricted phenolic analog of the neurotransmitter serotonin and agonist selective for serotonin (5-HT2-type) receptors. J Med Chem 35:3625-32 (1992)  
Target
Name:
5-hydroxytryptamine receptor 1D
Synonyms:
5-HT-1D 5-HT1D 5HT1D_HUMAN HTR1DA Serotonin (5-HT) receptor | Serotonin Receptor 1D
Type:
G Protein-Coupled Receptor (GPCR)
Mol. Mass.:
41920.63
Organism:
Homo sapiens (Human)
Description:
Receptor binding assays were performed using human clone stably expressed in CHO cells.
Residue:
377
  
Inhibitor
Name:
BDBM50003036
Synonyms:
CHEMBL412876 | Dimethyl-[2-(3,7,8,9-tetrahydro-pyrano[3,2-e]indol-1-yl)-ethyl]-amine
Type:
Small organic molecule
Emp. Form.:
C15H20N2O
Mol. Mass.:
244.3321
SMILES:
CN(C)CCc1c[nH]c2ccc3OCCCc3c12
: