Target
5-hydroxytryptamine receptor 1A
Ligand
BDBM50003039
Substrate
Meas. Tech.
ChEBML_840
IC50
610±n/a nM
Citation
 Macor, JEFox, CBJohnson, CKoe, BKLebel, LAZorn, SH 1-(2-Aminoethyl)-3-methyl-8,9-dihydropyrano[3,2-e]indole: a rotationally restricted phenolic analog of the neurotransmitter serotonin and agonist selective for serotonin (5-HT2-type) receptors. J Med Chem 35:3625-32 (1992)  
Target
Name:
5-hydroxytryptamine receptor 1A
Synonyms:
5-HT-1A 5-HT1A 5-hydroxytryptamine receptor 1A (5HT1A) 5ht1a Htr1a Serotonin 1a (5-HT1a) receptor/Adrenergic receptor alpha-1 | Serotonin receptor 1A
Type:
G Protein-Coupled Receptor (GPCR)
Mol. Mass.:
46445.29
Organism:
Rattus norvegicus (rat)
Description:
Binding assays were performed using rat hippocampal membranes.
Residue:
422
  
Inhibitor
Name:
BDBM50003039
Synonyms:
2-(3,7,8,9-Tetrahydro-pyrano[3,2-e]indol-1-yl)-ethylamine | CHEMBL27173
Type:
Small organic molecule
Emp. Form.:
C13H16N2O
Mol. Mass.:
216.2789
SMILES:
NCCc1c[nH]c2ccc3OCCCc3c12
: