Target
Thymidylate synthase
Ligand
BDBM50003058
Substrate
Meas. Tech.
ChEBML_209105
IC50
>100000±n/a nM
Citation
 Gangjee, APatel, JKisliuk, RLGaumont, Y 5,10-Methylenetetrahydro-5-deazafolic acid and analogues: synthesis and biological activities. J Med Chem 35:3678-85 (1992)  
Target
Name:
Thymidylate synthase
Synonyms:
TSase Thymidylate Synthase (TS) thyA
Type:
Enzyme
Mol. Mass.:
36576.54
Organism:
Lactobacillus casei
Description:
Residue:
316
  
Inhibitor
Name:
BDBM50003058
Synonyms:
2-[4-(7-Amino-9-oxo-8,9-dihydro-2,5,6,8-tetraaza-cyclopenta[a]naphthalen-2-yl)-benzoylamino]-pentanedioic acid | CHEMBL331208
Type:
Small organic molecule
Emp. Form.:
C21H18N6O6
Mol. Mass.:
450.4042
SMILES:
Nc1nc(O)c2c3cn(cc3cnc2n1)-c1ccc(cc1)C(=O)NC(CCC(O)=O)C(O)=O
: