Target
Aromatase
Ligand
BDBM50003129
Substrate
Meas. Tech.
ChEBML_50556
IC50
8700.0±n/a nM
Citation
 McCague, RRowlands, MG Conformational analysis of the aromatase inhibitor 3-ethyl-3-(4-pyridyl)piperidine-2,6-dione (rogletimide) and discovery of potent 5-alkyl derivatives. J Med Chem 35:3699-704 (1992)  
Target
Name:
Aromatase
Synonyms:
ARO1 CP19A_HUMAN CYP19 CYPXIX Cytochrome P450 19A1 Cytochrome P450-C19 (CYP19) FL cytokine receptor precursor | P-450AROM
Type:
Enzyme
Mol. Mass.:
57888.92
Organism:
Homo sapiens (Human)
Description:
P11511
Residue:
503
  
Inhibitor
Name:
BDBM50003129
Synonyms:
5-Butyl-3-ethyl-4,5-dihydro-3H-[3,4']bipyridinyl-2,6-dione | CHEMBL333185
Type:
Small organic molecule
Emp. Form.:
C16H22N2O2
Mol. Mass.:
274.3581
SMILES:
CCCC[C@H]1C[C@@](CC)(C(=O)NC1=O)c1ccncc1
: