Target
Type-1 angiotensin II receptor B
Ligand
BDBM50003156
Substrate
Meas. Tech.
ChEBML_34834
Ki
15±n/a nM
Citation
 De, BWinn, MZydowsky, TMKerkman, DJDeBernardis, JFLee, JBuckner, SWarner, RBrune, MHancock, A Discovery of a novel class of orally active, non-peptide angiotensin II antagonists. J Med Chem 35:3714-7 (1992)  
Target
Name:
Type-1 angiotensin II receptor B
Synonyms:
AGTRB_RAT Agtr1 Angiotensin II AT1B Angiotensin II type 1b (AT-1b) receptor Type-1B angiotensin II receptor
Type:
Enzyme Catalytic Domain
Mol. Mass.:
40929.44
Organism:
RAT
Description:
Angiotensin II AT1B 0 RAT::P29089
Residue:
359
  
Inhibitor
Name:
BDBM50003156
Synonyms:
4-{Butyl-[2''-(1H-tetrazol-5-yl)-biphenyl-4-ylmethyl]-amino}-2-methyl-pyrimidine-5-carboxylic acid;Hydro chloride CHEMBL1237156 | CHEMBL124772
Type:
Small organic molecule
Emp. Form.:
C24H25N7O2
Mol. Mass.:
443.501
SMILES:
CCCCN(Cc1ccc(cc1)-c1ccccc1-c1nnn[nH]1)c1nc(C)ncc1C(O)=O
: