Target
cAMP-dependent protein kinase catalytic subunit alpha
Ligand
BDBM50242733
Substrate
Meas. Tech.
ChEMBL_1672175 (CHEMBL4022204)
IC50
<10.0±n/a nM
Citation
 Huck, BRMochalkin, I Recent progress towards clinically relevant ATP-competitive Akt inhibitors. Bioorg Med Chem Lett 27:2838-2848 (2017)  
Target
Name:
cAMP-dependent protein kinase catalytic subunit alpha
Synonyms:
KAPCA_HUMAN PKACA cAMP-dependent protein kinase (PKA) cAMP-dependent protein kinase catalytic subunit alpha cAMP-dependent protein kinase catalytic subunit alpha (PKACA) cAMP-dependent protein kinase catalytic subunit alpha isoform 1 | cAMP-dependent protein kinase, alpha-catalytic subunit
Type:
Enzyme Catalytic Subunit
Mol. Mass.:
40598.73
Organism:
Homo sapiens (Human)
Description:
Residue:
351
  
Inhibitor
Name:
BDBM50242733
Synonyms:
AT-13148
Type:
Small organic molecule
Emp. Form.:
C17H16ClN3O
Mol. Mass.:
313.781
SMILES:
NC[C@@](O)(c1ccc(Cl)cc1)c1ccc(cc1)-c1cn[nH]c1
: